{"text_format":"1","workbook":"xlsx","n_sheets":4,"sheets":["simulateur","table_simulateur","Feuil1","Feuil2"],"not_rendered":{"charts":1,"images":0,"macros":1,"external_links":0,"defined_names":49,"comments":1,"pivot_tables":0},"unopened":[],"bounds":{"document_bytes":16777216,"sheet_cells":100000,"rows_first":2000,"rows_last":500,"rows_between":2000,"halvings":0,"cell_chars":16384,"cell_head_chars":4096},"cells_cut":0,"cells_raw":0,"read":"whole","date_system":"1900"}

{"sheet":"simulateur","index":0,"n_rows":182,"n_cols":13,"rows_kept":182,"cut":false,"hidden":false,"merged":[[112,2,112,5],[113,2,113,5],[114,2,114,5],[115,2,115,5],[98,2,98,5],[99,2,99,5],[100,2,100,5],[101,2,101,5],[102,2,102,5],[154,2,154,5],[103,2,103,5],[135,2,135,5],[132,2,132,5],[131,2,131,5],[128,2,128,5],[125,2,125,5],[122,2,122,5],[116,2,116,5],[104,2,104,5],[105,2,105,5],[106,2,106,5],[107,2,107,5],[108,2,108,5],[109,2,109,5],[110,2,110,5],[140,2,140,5],[149,2,149,5],[148,2,148,5],[152,2,152,5],[153,2,153,5],[97,2,97,5],[176,2,176,5],[147,2,147,5],[151,2,151,5],[161,2,161,5],[166,2,166,5],[168,2,168,5],[170,2,170,5],[171,2,171,5],[162,2,162,5],[156,2,156,5],[157,2,157,5],[158,2,158,5],[159,2,159,5],[138,2,138,5],[139,2,139,5],[79,2,79,4],[80,2,80,4],[81,2,81,4],[83,2,83,4],[84,2,84,4],[67,2,67,5],[68,2,68,5],[57,2,57,5],[60,2,60,5],[61,2,61,5],[62,2,62,5],[65,2,65,5],[66,2,66,5]]}
[null,"Sélection type de bien :",null,null,"Logement (étage)"]
[]
[null,"Entrée :",null,1,null,null,null,null,null,"Montant total TTC :",null,{"$f":"I182","v":{"$error":"#REF!"}}]
[null,null,null,null,null,null,null,null,null,null,null,{"$f":"L3/D10","v":{"$error":"#REF!"}},{"$f":"3500000/table_simulateur!C21","v":289.29540863389781}]
[null,"Etage :",null,"1er étage"]
[null,null,null,null,null,null,null,null,null,{"$f":"B44","v":"1 - Honoraires"},null,null,{"$f":"SUM(I45:I51)","v":{"$error":"#REF!"}}]
[null,{"$f":"IF(bien=table_simulateur!A3,\"N° Bureau :\",IF(bien=table_simulateur!A2,\"N° appartement :\",\"\"))","v":"N° appartement :"},null,"Apt 111",null,null,null,null,null,{"$f":"B54","v":"2- Travaux d'Etanchéité des loggias, garde-corps"},null,null,{"$f":"SUM(I56:I69)","v":{"$error":"#REF!"}}]
[null,null,null,null,null,null,null,null,null,{"$f":"B71","v":"3 - Remplacement des chassis"},null,null,{"$f":"SUM(I71:I86)","v":{"$error":"#REF!"}}]
[null,"Typologie :",null,{"$f":"IF(table_simulateur!B20<>\"\",table_simulateur!B20,\"\")","v":"Type IVbis"},null,null,null,null,null,{"$f":"B88","v":"4 - Isolation et ravalement de façade"},null,null,{"$f":"SUM(I89:I118)","v":{"$error":"#N/A"}}]
[null,"Surface :",null,{"$f":"IF(table_simulateur!B21<>\"\",table_simulateur!B21,\"\")","v":98.72},null,null,null,null,null,{"$f":"B120","v":"5 - Isolation de la toiture"},null,null,{"$f":"SUM(I121:I143)","v":{"$error":"#N/A"}}]
[null,"Tantièmes :",null,{"$f":"IF(table_simulateur!B24<>\"\",table_simulateur!B24,\"\")","v":8.1600000000000006E-3},"mettre en valeur numerique",null,null,null,null,{"$f":"B144","v":"6 - Traitement des Rez-de-Chaussée"},null,null,{"$f":"SUM(I144:I173)","v":{"$error":"#REF!"}}]
[null,"Surface des loggias :",null,{"$f":"IF(table_simulateur!B25<>\"\",table_simulateur!B25,\"\")","v":12.71},null,null,null,null,null,{"$f":"B174","v":"7 - Traitement des Sous-sols"},null,null,{"$f":"SUM(I174:I177)","v":{"$error":"#REF!"}}]
[null,"Lineaire de garde-corps :",null,{"$f":"IF(table_simulateur!B26<>\"\",table_simulateur!B26,\"\")","v":6.75},null,null,null,null,null,null,null,null,{"$f":"SUM(M6:M12)","v":{"$error":"#REF!"}}]
[null,"Surface chassis Mormal :",null,{"$f":"IF(table_simulateur!B27<>\"\",table_simulateur!B27,\"\")","v":15.34}]
[null,"Surface chassis parc et pignon :",null,{"$f":"IF(table_simulateur!B28<>\"\",table_simulateur!B28,\"\")","v":14.3}]
[]
[]
["Financement"]
[]
[null,null,"Montant des travaux :",{"$f":"SUMIF(table_simulateur!O186:O377,\"oui\",table_simulateur!J186:J377)","v":48583.930009575335},"TTC"]
[null,null,"Ecopret :",23440.81,"TTC sur 10 ans"]
[null,null,"Solde à financer :",{"$f":"cout_travaux-ecopret","v":25143.120009575334}]
[null,null,"Taux du prêt :","3,25%"]
[null,null,"Taux de l'assurance du prêt :","0,25%"]
[null,null,"Durée du prêt :","10","ans"]
[]
[null,null,"Coût de la mensualité :",{"$f":"ecopret/120+IF(ISERROR((D22*(D23+D24)/12)/(1-(1+(D23+D24)/12)^(-12*D25))),\"\",IF(AND(taux_pret<>\"\",taux_assurance<>\"\",duree_pret<>\"\"),(D22*(D23+D24)/12)/(1-(1+(D23+D24)/12)^(-12*D25)),\"\"))","v":443.97000661789343}]
[null,null,"Coût total du prêt (compris assurance) :",{"$f":"IF(ISERROR(D25*12*D27-D22),\"\",IF(AND(taux_pret<>\"\",taux_assurance<>\"\",duree_pret<>\"\"),D25*12*D27-D22-ecopret,\"\"))","v":4692.4707845718731}]
[]
["Valeur du bien"]
[null,null,"valeur fonciere actuelle",2400,{"$f":"ROUND(D31*D10,-2)","v":236900}]
[null,null,"valeur fonciere envisagée",3000,{"$f":"ROUND(D32*D10,-2)","v":296200}]
[null,null,"évolution de l'immobilier",0.02,"/an"]
[]
["Economies de charges"]
[null,null,"consommation actuelle",{"$f":"166*D10/0.865","v":18945.109826589596}]
[null,null,"consommation future",{"$f":"109*D10/0.865","v":12439.8612716763}]
[null,null,"cout kWh actuel gaz",0.05,"€ TTC/kWh hors abonnement"]
[null,null,"évolution cout gaz",0.02,"/an"]
[]
[]
["Devis"]
[null,null,null,null,null,null,"MONTANT HT","TVA","MONTANT TTC","MONTANT TOTAL PROJET TTC","Répartition","imputation","total"]
[null,"1 - Honoraires"]
[null,null,{"$f":"table_simulateur!#REF!","v":{"$error":"#REF!"}},null,null,null,{"$f":"ROUND(OFFSET(table_simulateur!F$186,MATCH(C45,table_simulateur!B$186:B$384,0)-1,0)*OFFSET(table_simulateur!B$20,MATCH(K45,table_simulateur!D$21:D$31,0),0)/OFFSET(table_simulateur!B$20,MATCH(K45,table_simulateur!D$21:D$31,0),1),2)","v":{"$error":"#REF!"}},{"$f":"OFFSET(table_simulateur!H$186,MATCH(C45,table_simulateur!B$186:B$384,0)-1,0)","v":{"$error":"#REF!"}},{"$f":"ROUND(G45*(1+H45),2)","v":{"$error":"#REF!"}},{"$f":"+G45*M45/L45","v":{"$error":"#REF!"}},"tantièmes",{"$f":"OFFSET(table_simulateur!B$20,MATCH(simulateur!K45,table_simulateur!D$21:D$31,0),0)","v":8.1600000000000006E-3},{"$f":"OFFSET(table_simulateur!C$20,MATCH(simulateur!K45,table_simulateur!D$21:D$31,0),0)","v":0.99990000000000134}]
[null,null,{"$f":"table_simulateur!#REF!","v":{"$error":"#REF!"}},null,null,null,{"$f":"ROUND(OFFSET(table_simulateur!F$186,MATCH(C46,table_simulateur!B$186:B$384,0)-1,0)*OFFSET(table_simulateur!B$20,MATCH(K46,table_simulateur!D$21:D$31,0),0)/OFFSET(table_simulateur!B$20,MATCH(K46,table_simulateur!D$21:D$31,0),1),2)","v":{"$error":"#REF!"}},{"$f":"OFFSET(table_simulateur!H$186,MATCH(C46,table_simulateur!B$186:B$384,0)-1,0)","v":{"$error":"#REF!"}},{"$error":"#REF!"},{"$error":"#REF!"},"tantièmes",{"$f":"OFFSET(table_simulateur!B$20,MATCH(simulateur!K46,table_simulateur!D$21:D$31,0),0)","v":8.1600000000000006E-3},{"$f":"OFFSET(table_simulateur!C$20,MATCH(simulateur!K46,table_simulateur!D$21:D$31,0),0)","v":0.99990000000000134}]
[null,null,{"$f":"table_simulateur!#REF!","v":{"$error":"#REF!"}},null,null,null,{"$f":"ROUND(OFFSET(table_simulateur!F$186,MATCH(C47,table_simulateur!B$186:B$384,0)-1,0)*OFFSET(table_simulateur!B$20,MATCH(K47,table_simulateur!D$21:D$31,0),0)/OFFSET(table_simulateur!B$20,MATCH(K47,table_simulateur!D$21:D$31,0),1),2)","v":{"$error":"#REF!"}},{"$f":"OFFSET(table_simulateur!H$186,MATCH(C47,table_simulateur!B$186:B$384,0)-1,0)","v":{"$error":"#REF!"}},{"$error":"#REF!"},{"$error":"#REF!"},"tantièmes",{"$f":"OFFSET(table_simulateur!B$20,MATCH(simulateur!K47,table_simulateur!D$21:D$31,0),0)","v":8.1600000000000006E-3},{"$f":"OFFSET(table_simulateur!C$20,MATCH(simulateur!K47,table_simulateur!D$21:D$31,0),0)","v":0.99990000000000134}]
[null,null,{"$f":"table_simulateur!#REF!","v":{"$error":"#REF!"}},null,null,null,{"$f":"ROUND(OFFSET(table_simulateur!F$186,MATCH(C48,table_simulateur!B$186:B$384,0)-1,0)*OFFSET(table_simulateur!B$20,MATCH(K48,table_simulateur!D$21:D$31,0),0)/OFFSET(table_simulateur!B$20,MATCH(K48,table_simulateur!D$21:D$31,0),1),2)","v":{"$error":"#REF!"}},{"$f":"OFFSET(table_simulateur!H$186,MATCH(C48,table_simulateur!B$186:B$384,0)-1,0)","v":{"$error":"#REF!"}},{"$error":"#REF!"},{"$error":"#REF!"},"tantièmes",{"$f":"OFFSET(table_simulateur!B$20,MATCH(simulateur!K48,table_simulateur!D$21:D$31,0),0)","v":8.1600000000000006E-3},{"$f":"OFFSET(table_simulateur!C$20,MATCH(simulateur!K48,table_simulateur!D$21:D$31,0),0)","v":0.99990000000000134}]
[null,null,{"$f":"table_simulateur!#REF!","v":{"$error":"#REF!"}},null,null,null,{"$f":"ROUND(OFFSET(table_simulateur!F$186,MATCH(C49,table_simulateur!B$186:B$384,0)-1,0)*OFFSET(table_simulateur!B$20,MATCH(K49,table_simulateur!D$21:D$31,0),0)/OFFSET(table_simulateur!B$20,MATCH(K49,table_simulateur!D$21:D$31,0),1),2)","v":{"$error":"#REF!"}},{"$f":"OFFSET(table_simulateur!H$186,MATCH(C49,table_simulateur!B$186:B$384,0)-1,0)","v":{"$error":"#REF!"}},{"$error":"#REF!"},{"$error":"#REF!"},"tantièmes",{"$f":"OFFSET(table_simulateur!B$20,MATCH(simulateur!K49,table_simulateur!D$21:D$31,0),0)","v":8.1600000000000006E-3},{"$f":"OFFSET(table_simulateur!C$20,MATCH(simulateur!K49,table_simulateur!D$21:D$31,0),0)","v":0.99990000000000134}]
[null,null,{"$f":"table_simulateur!#REF!","v":{"$error":"#REF!"}},null,null,null,{"$f":"ROUND(OFFSET(table_simulateur!F$186,MATCH(C50,table_simulateur!B$186:B$384,0)-1,0)*OFFSET(table_simulateur!B$20,MATCH(K50,table_simulateur!D$21:D$31,0),0)/OFFSET(table_simulateur!B$20,MATCH(K50,table_simulateur!D$21:D$31,0),1),2)","v":{"$error":"#REF!"}},{"$f":"OFFSET(table_simulateur!H$186,MATCH(C50,table_simulateur!B$186:B$384,0)-1,0)","v":{"$error":"#REF!"}},{"$error":"#REF!"},{"$error":"#REF!"},"tantièmes",{"$f":"OFFSET(table_simulateur!B$20,MATCH(simulateur!K50,table_simulateur!D$21:D$31,0),0)","v":8.1600000000000006E-3},{"$f":"OFFSET(table_simulateur!C$20,MATCH(simulateur!K50,table_simulateur!D$21:D$31,0),0)","v":0.99990000000000134}]
[]
[null,null,{"$f":"\"Répartition des coûts : \"&K45","v":"Répartition des coûts : tantièmes"}]
[]
[null,"2- Travaux d'Etanchéité des loggias, garde-corps"]
[]
[null,"Le loggia est-il actuellement recouvert d'un revêtement de sol de type carrelage / pavage?",null,null,null,"non"]
[]
[null,null,{"$f":"table_simulateur!B192","v":"Option : Dépose des revetements de sol mis en œuvre par les propriétaires et évacuation."},null,null,null,{"$f":"IF(F56=\"oui\",D12*table_simulateur!E192,\"pas de revêtement à déposer\")","v":"pas de revêtement à déposer"},{"$f":"OFFSET(table_simulateur!H$186,MATCH(C58,table_simulateur!B$186:B$384,0)-1,0)","v":7.0000000000000007E-2},{"$f":"IF(F56=\"oui\",ROUND(G58*(1+H58),2),0)","v":0},null,"option"]
[]
[null,null,{"$f":"\"Répartition des coûts : \"&K61","v":"Répartition des coûts : surface de loggia"}]
{"$rows_left_out":123}
{"sheet":"table_simulateur","index":1,"n_rows":375,"n_cols":26,"rows_kept":375,"cut":false,"hidden":false,"merged":[[226,1,226,2],[245,1,245,2],[228,1,228,2],[316,1,316,2],[234,1,234,2],[238,1,238,2],[237,1,237,2],[239,1,239,2],[240,1,240,2],[241,1,241,2],[242,1,242,2],[236,1,236,2],[294,1,294,2],[292,1,292,2],[264,1,264,2],[265,1,265,2],[353,1,353,2],[362,1,362,2],[327,1,327,2],[246,1,246,2],[310,1,310,2],[311,1,311,2],[359,1,359,2],[360,1,360,2],[251,1,251,2],[263,1,263,2],[255,1,255,2],[259,1,259,2],[337,1,337,2],[283,1,283,2],[338,1,338,2],[341,1,341,2],[331,1,331,2],[343,1,343,2],[345,1,345,2],[323,1,323,2],[304,1,304,2],[295,1,295,2],[324,1,324,2],[325,1,325,2],[366,1,366,2],[367,1,367,2],[284,1,284,2],[247,1,247,2],[286,1,286,2],[320,1,320,2],[334,1,334,2],[256,1,256,2],[244,1,244,2],[249,1,249,2],[303,1,303,2],[307,1,307,2],[313,1,313,2],[314,1,314,2],[315,1,315,2],[317,1,317,2],[346,1,346,2],[291,1,291,2],[348,1,348,2],[322,1,322,2],[287,1,287,2],[319,1,319,2],[321,1,321,2],[358,1,358,2],[185,5,185,6],[203,1,203,2],[269,1,269,2],[209,1,209,2],[200,1,200,2],[197,1,197,2],[194,1,194,2],[206,1,206,2],[193,1,193,2],[205,1,205,2],[208,1,208,2],[199,1,199,2],[196,1,196,2],[202,1,202,2],[218,1,218,2],[219,1,219,2],[225,1,225,2],[229,1,229,2],[261,1,261,2],[190,1,190,2],[211,1,211,2],[221,1,221,2],[232,1,232,2],[233,1,233,2],[340,1,340,2],[235,1,235,2],[243,1,243,2],[273,1,273,2],[293,1,293,2],[266,1,266,2],[332,1,332,2],[335,1,335,2],[298,1,298,2],[299,1,299,2],[306,1,306,2],[308,1,308,2],[296,1,296,2],[300,1,300,2],[301,1,301,2],[372,1,372,2],[215,1,215,2],[216,1,216,2],[285,1,285,2],[248,1,248,2],[191,1,191,2],[276,1,276,2],[277,1,277,2],[282,1,282,2],[270,1,270,2],[271,1,271,2],[279,1,279,2],[280,1,280,2],[275,1,275,2],[278,1,278,2],[274,1,274,2],[272,1,272,2],[349,1,349,2],[350,1,350,2],[351,1,351,2],[260,1,260,2],[267,1,267,2],[268,1,268,2],[257,1,257,2]]}
["table_simu_liste_bien","table_simu_liste_entree","table_simu_liste_etage"]
["Logement (étage)",{"$f":"IF(bien=A2,1,IF(bien=A3,1,\"\"))","v":1},{"$f":"IF(bien=A2,\"1er étage\",IF(bien=A3,\"Rez-de-Chaussée\",\"\"))","v":"1er étage"}]
["Bureau (rez-de-chaussée)",{"$f":"IF(AND(B2<>\"\",B2<>9),B2+1,\"\")","v":2},{"$f":"IF(bien=A$2,\"2ème étage\",\"\")","v":"2ème étage"}]
[null,3,{"$f":"IF(bien=A$2,\"3ème étage\",\"\")","v":"3ème étage"}]
[null,4,{"$f":"IF(bien=A$2,\"4ème étage\",\"\")","v":"4ème étage"}]
[null,5,{"$f":"IF(bien=A$2,\"5ème étage\",\"\")","v":"5ème étage"}]
[null,6,null,"Conciergerie1"]
[null,7]
[null,8]
[null,{"$f":"IF(AND(B9<>\"\",B9<>9),B9+1,\"\")","v":9}]
[]
["table_simu_liste_numero",null,null,null,null,null,null,"Bureau",{"$f":"SUMIF(D$38:D$177,H12,E$38:E$177)","v":903.91000000000008},{"$f":"COUNTIF(D$38:D$177,H12)","v":9}]
[{"$f":"IF(AND(bien<>\"\",simulateur!D3<>\"\",simulateur!D5<>\"\"),IF(bien=A2,\"Apt \",\"\")&IF(bien=A3,IF(saisie_entree=1,\"Conciergerie\",\"Com\"),\"\")&simulateur!D3&IF(bien=table_simulateur!A2,LEFT(simulateur!D5,1)&\"1\",\"\"),\"\")","v":"Apt 111"},null,null,null,null,null,null,"Type I",{"$f":"SUMIF(D$38:D$177,H13,E$38:E$177)","v":26.9},{"$f":"COUNTIF(D$38:D$177,H13)","v":1}]
[{"$f":"IF(bien=A2,OFFSET(C37,MATCH(A13,C37:C177,0),0),\"\")","v":"Apt 112"},null,null,null,null,null,null,"Type II",1718.4000000000008,{"$f":"COUNTIF(D$38:D$177,H14)","v":40}]
[{"$f":"IF(bien=A2,IF(AND(saisie_entree=8,saisie_etage<>\"1er étage\"),\"\",OFFSET(C38,MATCH(A14,C38:C178,0),0)),\"\")","v":"Apt 113"},null,null,null,null,null,null,"Type IIe ",317.64999999999998,5]
["select apt",null,null,null,null,null,null,"Type IV",2467.9999999999995,{"$f":"COUNTIF(D$38:D$177,H16)","v":25}]
[{"$f":"saisie_numeroapt","v":"Apt 111"},null,null,null,null,null,null,"Type IVbis",2961.5999999999985,{"$f":"COUNTIF(D$38:D$177,H17)","v":30}]
[null,null,null,null,null,null,null,"Type V",2371.7999999999997,20]
[null,null,"TOTAL",null,null,null,null,"Type Vg",594.6,5]
["Typologie :",{"$f":"IF(A17<>0,OFFSET(D37,MATCH(A17,C37:C177,0)-1,0),\"\")","v":"Type IVbis"},null,null,null,null,null,"Type VI",125.58,1]
["Surface :",{"$f":"IF(A17<>0,OFFSET(E37,MATCH(A17,C37:C177,0)-1,0),\"\")","v":98.72},{"$f":"E179","v":12098.359999999986},{"$f":"E36","v":"surface habitable"},null,null,null,"Type VIIc",609.91999999999996,4]
["Surface bureaux seuls:",{"$f":"IF(A17<>0,OFFSET(F37,MATCH(A17,C37:C177,0)-1,0),\"\")","v":0},{"$f":"F179","v":903.91000000000008},{"$f":"F36","v":"surface des bureaux"},null,null,null,null,{"$f":"SUM(I12:I21)","v":12098.359999999999},{"$f":"SUM(J12:J21)","v":140}]
["Surface logements seuls:",{"$f":"IF(A17<>0,OFFSET(G37,MATCH(A17,C37:C177,0)-1,0),\"\")","v":98.72},{"$f":"G179","v":11194.449999999992},{"$f":"G36","v":"surface des logements"}]
["Tantièmes :",{"$f":"IF(A17<>0,OFFSET(H37,MATCH(A17,C37:C177,0)-1,0),\"\")","v":8.1600000000000006E-3},{"$f":"H179","v":0.99990000000000134},{"$f":"H36","v":"tantièmes"}]
["Surface loggia :",{"$f":"IF(A17<>0,OFFSET(I37,MATCH(A17,C37:C177,0)-1,0),\"\")","v":12.71},{"$f":"I179+1.54","v":1496.9000000000012},{"$f":"I36","v":"surface de loggia"}]
["Lineaire garde-corps :",{"$f":"IF(A17<>0,OFFSET(J37,MATCH(A17,C37:C177,0)-1,0),\"\")","v":6.75},{"$f":"J179","v":969.80999999999983},{"$f":"J36","v":"linéaire de garde-corps"}]
["Surface chassis mormal :",{"$f":"IF(A17<>0,OFFSET(L37,MATCH(A17,C37:C177,0)-1,0),\"\")","v":15.34},{"$f":"L179","v":1425.8499999999983},"Surface chassis Mormal"]
["Surface chassis parc et pignon :",{"$f":"IF(A17<>0,OFFSET(M37,MATCH(A17,C37:C177,0)-1,0),\"\")","v":14.3},{"$f":"M179","v":1817.8999999999999},"Surface chassis Parc"]
["Chassis pignons :",{"$f":"IF(A17<>0,OFFSET(S37,MATCH(A17,C37:C177,0)-1,0),\"\")","v":1},{"$f":"S179","v":10},"Surface chassis pignons"]
["Surface totale chassis :",{"$f":"B28+B27","v":29.64},{"$f":"K179","v":3243.7499999999955},{"$f":"K36","v":"surface actuelle des chassis"}]
["Surface option vitrage :",{"$f":"IF(A17<>0,OFFSET(N37,MATCH(A17,C37:C177,0)-1,0),\"\")","v":3.1},null,"option vitrage surface"]
[]
[]
[]
[null,null,null,null,null,null,null,"METTRE LES TANTIEMES EN FRACTION"]
[null,null,null,null,"surface habitable","surface des bureaux","surface des logements","tantièmes","surface de loggia","linéaire de garde-corps","surface actuelle des chassis","Surface chassis Parc","Surface chassis Mormal",null,null,null,null,null,"Chassis pignons :"]
["Entrée","Niveau","N°appt","Typo","Surface","Surface bureaux seuls","Surface logements seuls","Tantièmes","Surface de loggia","Linéaire de garde-corps","Surface actuelle chassis","Surface actuelle de chassis Façade avenue Mormal","Surface actuelle de chassis Façade avenue Mormal","Option : surface opaque à passer en vitrée","Chassis type C8","Chassis type C9","Chassis type C20","Chassis type C21","Chassis type P1",null,"N°Lot","Quote part parties communes générales","Quote part parties communes particulières","N°logt"]
[1,"R","Conciergerie1","Bureau",43.27,{"$f":"E38","v":43.27},null,{"$f":"ROUND(E38/E$179,5)","v":3.5799999999999998E-3},0,0]
[2,"R","Bur2","Bureau",107.58,107.58,null,8.8900000000000003E-3,0,0,null,null,null,null,null,null,null,null,null,null,"701/1",{"$f":"ROUND(1585/2,0)","v":793},{"$f":"ROUND(201/2,0)","v":101},"1/1"]
[3,"R","Bur3","Bureau",107.58,107.58,null,8.8900000000000003E-3,0,0,null,null,null,null,null,null,null,null,null,null,"701/2",{"$f":"ROUND(1585/2,0)","v":793},{"$f":"ROUND(201/2,0)","v":101},"1/2"]
[4,"R","Bur4","Bureau",107.58,107.58,null,8.8900000000000003E-3,0,0,null,null,null,null,null,null,null,null,null,null,"702/1",{"$f":"ROUND(1554/2,0)","v":777},{"$f":"ROUND(198/2,0)","v":99},"2/1"]
[5,"R","Bur5","Bureau",107.58,107.58,null,8.8900000000000003E-3,0,0,null,null,null,null,null,null,null,null,null,null,"702/2",{"$f":"ROUND(1554/2,0)","v":777},{"$f":"ROUND(198/2,0)","v":99},"2/2"]
[6,"R","Bur6","Bureau",107.58,107.58,null,8.8900000000000003E-3,0,0,null,null,null,null,null,null,null,null,null,null,"703/1",{"$f":"ROUND(1555/2,0)","v":778},{"$f":"ROUND(198/2,0)","v":99},"3/1"]
[7,"R","Bur7","Bureau",107.58,107.58,null,8.8900000000000003E-3,0,0,null,null,null,null,null,null,null,null,null,null,"703/2",{"$f":"ROUND(1555/2,0)","v":778},{"$f":"ROUND(198/2,0)","v":99},"3/2"]
[8,"R","Bur8","Bureau",107.58,107.58,null,8.8900000000000003E-3,0,0,null,null,null,null,null,null,null,null,null,null,"704/1",{"$f":"1584/2","v":792},{"$f":"ROUND(201/2,0)","v":101},"4/1"]
[9,"R","Bur9","Bureau",107.58,107.58,null,8.8900000000000003E-3,0,0,null,null,null,null,null,null,null,null,null,null,"704/2",{"$f":"1584/2","v":792},{"$f":"ROUND(201/2,0)","v":101},"4/2"]
[1,1,"Apt 111","Type IVbis",98.72,null,{"$f":"E47","v":98.72},8.1600000000000006E-3,12.71,6.75,{"$f":"L47+M47","v":29.64},{"$f":"ROUND(1.44*(3.15+3.75+3.75),2)","v":15.34},{"$f":"ROUND(P47*(2.5*3.6)+R47*(3.6*2.5-2.05*1.795)+O47*(2.5*3.6-1.31*2.05-2.29*1.2)+Q47*(2.5*3-1.495*2.05)+S47*1.4*0.61,1)","v":14.3},{"$f":"ROUND(R47*(2.05*1.795)+O47*(1.31*1.2+2.29*1.2)+Q47*(1.495*2.05),1)","v":3.1},0,1,1,0,1,null,"?",0,0,0]
[1,1,"Apt 112","Type II",42.96,null,{"$f":"E48","v":42.96},3.5500000000000002E-3,7.16,7.35,{"$f":"L48+M48","v":12.6},0,{"$f":"ROUND(P48*(2.5*3.6)+R48*(3.6*2.5-2.05*1.795)+O48*(2.5*3.6-1.31*2.05-2.29*1.2)+Q48*(2.5*3-1.495*2.05)+S48*1.4*0.61,1)","v":12.6},{"$f":"ROUND(R48*(2.05*1.795)+O48*(1.31*1.2+2.29*1.2)+Q48*(1.495*2.05),1)","v":4.3},1,1,0,0,0,null,705,394,50,121]
[1,1,"Apt 113","Type IVbis",98.72,null,98.72,8.1600000000000006E-3,12.71,6.75,28.740000000000002,{"$f":"ROUND(1.44*(3.15+3.75+3.75),2)","v":15.34},13.4,3.1,0,1,1,0,0,null,706,790,101,116]
[1,2,"Apt 121","Type IVbis",98.72,null,98.72,8.1600000000000006E-3,12.71,6.75,29.64,{"$f":"ROUND(1.44*(3.15+3.75+3.75),2)","v":15.34},14.3,3.1,0,1,1,0,1,null,730,807,103,127]
[1,2,"Apt 122","Type II",42.96,null,42.96,3.5500000000000002E-3,7.16,7.35,12.6,0,12.6,4.3,1,1,0,0,0,null,731,403,51,122]
[1,2,"Apt 123","Type IVbis",98.72,null,98.72,8.1600000000000006E-3,12.71,6.75,28.740000000000002,{"$f":"ROUND(1.44*(3.15+3.75+3.75),2)","v":15.34},13.4,3.1,0,1,1,0,0,null,732,807,103,117]
[1,3,"Apt 131","Type IVbis",98.72,null,98.72,8.1600000000000006E-3,12.71,6.75,29.64,{"$f":"ROUND(1.44*(3.15+3.75+3.75),2)","v":15.34},14.3,3.1,0,1,1,0,1,null,756,823,105,128]
[1,3,"Apt 132","Type II",42.96,null,42.96,3.5500000000000002E-3,7.16,7.35,12.6,0,12.6,4.3,1,1,0,0,0,null,757,411,52,123]
[1,3,"Apt 133","Type IVbis",98.72,null,98.72,8.1600000000000006E-3,12.71,6.75,28.740000000000002,{"$f":"ROUND(1.44*(3.15+3.75+3.75),2)","v":15.34},13.4,3.1,0,1,1,0,0,null,758,823,105,118]
[1,4,"Apt 141","Type IVbis",98.72,null,98.72,8.1600000000000006E-3,12.71,6.75,29.64,{"$f":"ROUND(1.44*(3.15+3.75+3.75),2)","v":15.34},14.3,3.1,0,1,1,0,1,null,782,840,107,129]
[1,4,"Apt 142","Type II",42.96,null,42.96,3.5500000000000002E-3,7.16,7.35,12.6,0,12.6,4.3,1,1,0,0,0,null,783,419,53,124]
[1,4,"Apt 143","Type IVbis",98.72,null,98.72,8.1600000000000006E-3,12.71,6.75,28.740000000000002,{"$f":"ROUND(1.44*(3.15+3.75+3.75),2)","v":15.34},13.4,3.1,0,1,1,0,0,null,784,840,107,119]
[1,5,"Apt 151","Type IVbis",98.72,null,98.72,8.1600000000000006E-3,12.71,6.75,29.64,{"$f":"ROUND(1.44*(3.15+3.75+3.75),2)","v":15.34},14.3,3.1,0,1,1,0,1,null,808,857,109,130]
[1,5,"Apt 152","Type II",42.96,null,42.96,3.5500000000000002E-3,7.16,7.35,12.6,0,12.6,4.3,1,1,0,0,0,null,809,428,54,125]
{"$rows_left_out":316}
{"sheet":"Feuil1","index":2,"n_rows":14,"n_cols":13,"rows_kept":14,"cut":false,"hidden":true,"merged":[]}
[]
[]
[]
[]
[null,2013,2014,2015,2016,2017,2018,2019,2020,2021,2022,2023,2024]
["remboursement prêt et assurance",{"$f":"12*mensualite","v":5327.6400794147212},{"$f":"B6","v":5327.6400794147212},{"$f":"C6","v":5327.6400794147212},5327.6400794147212,5327.6400794147212,5327.6400794147212,5327.6400794147212,5327.6400794147212,5327.6400794147212,5327.6400794147212]
["remboursement prêt et assurance cumulé",{"$f":"B6","v":5327.6400794147212},{"$f":"C6+B7","v":10655.280158829442},15982.920238244164,21310.560317658885,26638.200397073604,31965.840476488323,37293.480555903043,42621.120635317762,47948.760714732482,53276.400794147201,53276.400794147201,53276.400794147201]
["économie de charges",{"$f":"simulateur!D38*(simulateur!D37-simulateur!D36)","v":-325.26242774566481},{"$f":"B8*(1+simulateur!$D39)","v":-331.7676763005781},{"$f":"C8*(1+simulateur!$D39)","v":-338.40302982658966},{"$f":"D8*(1+simulateur!$D39)","v":-345.17109042312148},{"$f":"E8*(1+simulateur!$D39)","v":-352.07451223158392},{"$f":"F8*(1+simulateur!$D39)","v":-359.11600247621561},{"$f":"G8*(1+simulateur!$D39)","v":-366.29832252573993},{"$f":"H8*(1+simulateur!$D39)","v":-373.62428897625472},{"$f":"I8*(1+simulateur!$D39)","v":-381.09677475577979},{"$f":"J8*(1+simulateur!$D39)","v":-388.71871025089541},{"$f":"K8*(1+simulateur!$D39)","v":-396.49308445591333},{"$f":"L8*(1+simulateur!$D39)","v":-404.42294614503163}]
["économie de charges cumulé",{"$f":"B8","v":-325.26242774566481},{"$f":"C8+B9","v":-657.03010404624297},{"$f":"D8+C9","v":-995.43313387283263},-1340.6042242959541,-1692.6787365275379,-2051.7947390037534,-2418.0930615294933,-2791.7173505057481,-3172.8141252615278,-3561.5328355124234,-3958.0259199683369,-4362.4488661133682]
["coût cumulé des travaux",{"$f":"SUM(B7,B9)","v":5002.3776516690559},{"$f":"SUM(C7,C9)","v":9998.2500547831987},14987.48710437133,19969.956093362929,24945.521660546066,29914.045737484572,34875.38749437355,39829.403284812011,44775.946589470957,49714.867958634779,49318.374874178866,48913.951928033835]
[]
["Valeur du bien",{"$f":"valeur_logt_actuel","v":236900},{"$f":"valeur_logt_future*(1+simulateur!D33)","v":302124},{"$f":"C12*(1+simulateur!$D33)","v":308166.48},{"$f":"D12*(1+simulateur!$D33)","v":314329.80959999998},{"$f":"E12*(1+simulateur!$D33)","v":320616.40579200001},{"$f":"F12*(1+simulateur!$D33)","v":327028.73390783998},{"$f":"G12*(1+simulateur!$D33)","v":333569.3085859968},{"$f":"H12*(1+simulateur!$D33)","v":340240.69475771673},{"$f":"I12*(1+simulateur!$D33)","v":347045.50865287107},{"$f":"J12*(1+simulateur!$D33)","v":353986.41882592847},{"$f":"K12*(1+simulateur!$D33)","v":361066.14720244706},{"$f":"L12*(1+simulateur!$D33)","v":368287.47014649602}]
[]
["Valeur du bien - montant investi en travaux",{"$f":"B12-B10","v":231897.62234833094},292125.74994521681,293178.99289562867,294359.85350663704,295670.88413145393,297114.6881703554,298693.92109162326,300411.29147290473,302269.56206340011,304271.55086729367,311747.77232826821,319373.51821846218]

{"sheet":"Feuil2","index":3,"n_rows":14,"n_cols":6,"rows_kept":14,"cut":false,"hidden":false,"merged":[[13,5,13,13]]}
[]
[]
[]
[]
[]
[]
[]
[]
[]
[]
[null,null,null,null,null,"puis cliquez ici pour lancer le simulateur :"]
[]
[]
[null,null,null,null,null,"Si le bouton n'est pas visible, pensez à activer les macros."]